{"text_format":"1","workbook":"xlsx","n_sheets":6,"sheets":["Finish Times (2)","Fleet 1","Summary","Fleet 2","Fleet 3","Fleet 4"],"not_rendered":{"charts":0,"images":1,"macros":1,"external_links":0,"defined_names":4,"comments":0,"pivot_tables":0},"unopened":[],"bounds":{"document_bytes":16777216,"sheet_cells":100000,"rows_first":2000,"rows_last":500,"rows_between":2000,"halvings":0,"cell_chars":16384,"cell_head_chars":4096},"cells_cut":0,"cells_raw":0,"read":"whole","date_system":"1900"}

{"sheet":"Finish Times (2)","index":0,"n_rows":39,"n_cols":7,"rows_kept":39,"cut":false,"hidden":true,"merged":[]}
[]
[]
[]
["MUST",null,"FLEET 1"]
["BE",null,"FLEET 2"]
["IN ALPHA",null,"FLEET 3"]
["ORDER",null,"FLEET 4"]
[null,null,null,null,null,"Finish Time"]
["BOAT NAME","FLEET","BOAT","SAIL #","SKIPPER","MINUTES","SECONDS"]
["Bandit",1,"J/24",2792,"Cliborne"]
["Blunder Bus",1,"J/24",null,"Hardy"]
["Boogie Board",1,"J/24",1742,"Maloney"]
["Catch 22",1,"J22",826,"Schiable"]
["Dark Horse",1,"J/24",1024,"Forqurean"]
["Fox Trot",1,"Colgate 26",null,"Haddon"]
["Rascal",1,"J/24",3511,"Phillip"]
["Time Warp",1,"J/24",1248,"Sampson"]
["UDO",1,"VX One",119,"Gietl"]
["Destiny",2,"Alerion 20",6,"Whitt"]
["Fools Game",2,"Pearson 26",1183,"Hull"]
["Gotcha",2,"S-2 6.7",75,"Theis"]
["Majical",2,"Cal 25",1687,"Witten"]
["Severence",2,"C&C 25",14755,"Evans"]
["Stoic",2,"Harbor 20",330,"Hemler"]
["StressLess",2,"Harbor 20",212,"Breckenridge"]
["Synergy",2,"Harbor 20",215,"Miekina"]
["Circle Back",3,"Catalina 22","C22","Nash"]
["Miss Virginia",3,"Hunter 23.5",1309,"Perdue"]
["Norse Raider",3,"Ericson 23",23,"Short"]
["Second Wind",3,"Ericson 23",470,"Schraw"]
["Tundra Swan",3,"Hunter 23",1256,"Gobble"]
["Alarming",4,"S-2 9.2",505,"Oginz"]
["BILL",4,"Hunter 356",null,"Gillespie"]
["Felicite",4,"S-2 27 IB",13,"Johnson"]
["Got to Go",4,"Catalina 30",97,"Forrester"]
["Janet Anne",4,"Catalina 25",5155,"Tunnell"]
["Little Wing",4,"Beneteau 29",485,"DeMestro"]
["More Mischief",4,"Beneteau 285",144,"Gearhart"]
["Willaway",4,"Columbia 29",222,"Conover"]

{"sheet":"Fleet 1","index":1,"n_rows":49,"n_cols":36,"rows_kept":49,"cut":false,"hidden":true,"merged":[[5,0,5,12],[17,0,17,12],[29,0,29,12],[41,0,41,12]]}
["Control Z to run macro"]
[]
[{"$f":"#REF!","v":{"$error":"#REF!"}},"<-----Minutes after first start"]
[]
["Blackwater Yacht Racing Association - Spring 2018 Race Results - Fleet 1"]
[]
[null,null,null,null,"Spring","Spring","Spring","Spring","Spring","Spring","Spring","Spring","Spring","Spring",null,null,"Spring","Spring","Spring","Spring","Spring"]
["Skipper","Boat Name","Boat","Sail #","Race #1","Race #2","Race #3","Race #4","Race #5","Race #6","Race #7","Race #8","Make Up\n7m","Make Up\n2",null,null,"Sum","Throw\nout","Sum\nless\nThro out","Races\nthat\nCount","Avg"]
["Cliborne","Bandit","J/24",2792,1,null,1,1,1,1,null,null,1,2,null,null,{"$f":"SUM(E9:O9)","v":8},{"$f":"MAX(E9:O9)","v":2},{"$f":"Q9-R9","v":6},6,{"$f":"IFERROR(S9/T9,\"\")","v":1},null,null,null,null,null,null,null,null,null,null,null,null,null,null,{"$f":"(VLOOKUP($B9,#REF!,6,FALSE))","v":{"$error":"#REF!"}}]
["Schaible","Catch 22","J22",826,4,null,1,1,null,null,null,null,2,3,null,null,{"$f":"SUM(E10:O10)","v":11},null,{"$f":"Q10-R10","v":11},{"$f":"COUNTA(E10:O10)","v":5},{"$f":"IFERROR(S10/T10,\"\")","v":2.2000000000000002},null,null,null,null,null,null,null,null,null,null,null,null,null,null,{"$f":"(VLOOKUP($B10,#REF!,6,FALSE))","v":{"$error":"#REF!"}}]
["Forqurean","Dark Horse","J/24",1024,4,null,null,null,null,null,null,null,3,1,null,null,null,null,null,null,null,null,null,null,null,null,null,null,null,null,null,null,null,null,null,{"$f":"(VLOOKUP($B11,#REF!,6,FALSE))","v":{"$error":"#REF!"}}]
["Theis","Gotcha","S-2 6.7",75,null,null,null,null,null,null,null,null,null,null,null,null,null,null,null,null,null,null,null,null,null,null,null,null,null,null,null,null,null,null,null,{"$f":"(VLOOKUP($B12,#REF!,6,FALSE))","v":{"$error":"#REF!"}}]
["Evans","Severence","C&C 25",14755,null,null,null,null,null,null,null,null,null,null,null,null,null,null,null,null,null,null,null,null,null,null,null,null,null,null,null,null,null,null,null,{"$f":"(VLOOKUP($B13,#REF!,6,FALSE))","v":{"$error":"#REF!"}}]
[null,null,null,null,null,null,null,null,null,null,null,null,null,null,null,null,null,null,null,null,null,null,null,null,null,null,null,null,null,null,null,null,null,null,null,{"$f":"(VLOOKUP($B14,#REF!,6,FALSE))","v":{"$error":"#REF!"}}]
["RC Score",null,null,null,null,null,null,null,null,null,null,null,null,null,null,null,null,null,null,null,null,null,null,null,null,null,null,null,null,null,null,null,null,null,null,{"$f":"(VLOOKUP($B15,#REF!,6,FALSE))","v":{"$error":"#REF!"}}]
["Throw Out",null,null,null,null,null,null,null,null,null,null,null,null,null,null,null,null,null,null,null,null,null,null,null,null,null,null,null,null,null,null,null,null,null,null,{"$f":"VLOOKUP($B16,#REF!,6,FALSE)","v":{"$error":"#REF!"}}]
["Blackwater Yacht Racing Association - Spring 2018 Race Results - Fleet 2",null,null,null,null,null,null,null,null,null,null,null,null,null,null,null,null,null,null,null,null,null,null,null,null,null,null,null,null,null,null,null,null,null,{"$f":"(VLOOKUP($B17,#REF!,6,FALSE))","v":{"$error":"#REF!"}}]
[]
[null,null,null,null,"Spring","Spring","Spring","Spring","Spring","Spring","Spring","Spring","Spring","Spring",null,null,"Spring","Spring","Spring","Spring","Spring"]
["Skipper","Boat Name","Boat","Sail #","Race #1","Race #2","Race #3","Race #4","Race #5","Race #6","Race #7","Race #8","Make Up\n7m","Make Up\n2",null,null,"Sum","Throw\nout","Sum\nless\nThro out","Races\nthat\nCount","Avg"]
["Arnold","Arnold","Harbor 20",null,null,null,null,null,null,null,null,null,null,null,null,null,null,null,null,null,{"$f":"IFERROR(S21/T21,\"\")","v":""}]
["Tunnell/Maloney","Courageous","Harbor 20",278,null,null,1,5,2,3,null,null,3,1,null,null,{"$f":"SUM(E22:O22)","v":15},{"$f":"MAX(E22:O22)","v":5},{"$f":"Q22-R22","v":10},5,{"$f":"IFERROR(S22/T22,\"\")","v":2}]
["Whitt","Destiny","Alerion 20",6,1,null,3,1,4,4,null,null,null,null,null,null,13,null,13,{"$f":"COUNTA(E23:O23)","v":5},2.6]
["Hemler","Stoic","Harbor 20",330,2,null,6,3,3,1,null,null,1,3,null,null,19,6,13,6,2.1666666666666665]
["Toone","StressLess","Harbor 20",212,1.75,null,2,2,1,2,null,null,2,5,null,null,15.75,5,10.75,6,1.7916666666666667]
["Miekina","Synergy","Harbor 20",215,4,null,4,4,null,null,null,null,4,2,null,null,18,null,18,5,3.6]
["RC Score"]
["Throw Out"]
["Blackwater Yacht Racing Association - Race Results - Fleet 3"]
[]
[null,null,null,null,"Spring","Spring","Spring","Spring","Spring","Spring","Spring","Spring","Spring","Spring",null,null,"Spring","Spring","Spring","Spring","Spring"]
["Skipper","Boat Name","Boat","Sail #","Race #1","Race #2","Race #3","Race #4","Race #5","Race #6","Race #7","Race #8","Make Up\n7m","Make Up\n2",null,null,"Sum","Throw\nout","Sum\nless\nThro out","Races\nthat\nCount","Avg"]
["Gobble","Always Something","Hunter 23",1256,4.5,null,5,5,4,4,null,null,null,null,null,null,{"$f":"SUM(E33:O33)","v":22.5},null,{"$f":"Q33-R33","v":22.5},{"$f":"COUNTA(E33:O33)","v":5},{"$f":"IFERROR(S33/T33,\"\")","v":4.5}]
["Perdue","Debra Ann","O'Day 25 CB",13092]
["Hull","Fools Game","Pearson 26",1183,1,null,3,3,2,1,null,null,3,3,null,null,{"$f":"SUM(E35:O35)","v":16},{"$f":"MAX(E35:O35)","v":3},{"$f":"Q35-R35","v":13},6,{"$f":"IFERROR(S35/T35,\"\")","v":2.1666666666666665}]
["Perdue","Miss Virginia","Hunter 23.5",1309,null,null,2,4,3.5,3.5,null,null,4,4,null,null,21,4,17,5,3.4]
["Schraw","Second Wind","Ericson 23",470,4,null,1,1,3,3,null,null,1,2,null,null,15,4,11,6,1.8333333333333333]
["Grogan","Twinkle","Hunter 23",686,2,null,4,2,1,2,null,null,2,1,null,null,14,4,10,6,1.6666666666666667]
["RC Score"]
["Throw Out"]
{"$rows_left_out":10}
{"sheet":"Summary","index":2,"n_rows":45,"n_cols":21,"rows_kept":45,"cut":false,"hidden":false,"merged":[[1,0,1,12],[13,0,13,12],[25,0,25,12],[37,0,37,12]]}
["Blackwater Yacht Racing Association - Spring 2018 Race Results - Fleet 1"]
[]
[null,null,null,null,"Spring","Spring","Spring","Spring","Spring","Spring","Spring","Spring","Spring","Spring",null,null,"Spring","Spring","Spring","Spring","Spring"]
["Skipper","Boat Name","Boat","Sail #","Race #1","Race #2","Race #3","Race #4","Race #5","Race #6","Race #7","Race #8","Make Up\n7m","Make Up\n2",null,null,"Sum","Throw\nout","Sum\nless\nThro out","Races\nthat\nCount","Avg"]
["Cliborne","Bandit","J/24",2792,1,null,1,1,1,1,null,null,1,2,null,null,{"$f":"SUM(E5:O5)","v":8},{"$f":"MAX(E5:O5)","v":2},{"$f":"Q5-R5","v":6},6,{"$f":"IFERROR(S5/T5,\"\")","v":1}]
["Schaible","Catch 22","J22",826,4,null,1,1,null,null,null,null,2,3,null,null,{"$f":"SUM(E6:O6)","v":11},null,{"$f":"Q6-R6","v":11},{"$f":"COUNTA(E6:O6)","v":5},{"$f":"IFERROR(S6/T6,\"\")","v":2.2000000000000002}]
["Forqurean","Dark Horse","J/24",1024,4,null,null,null,null,null,null,null,3,1]
["Theis","Gotcha","S-2 6.7",75]
["Evans","Severence","C&C 25",14755]
[]
["RC Score"]
["Throw Out"]
["Blackwater Yacht Racing Association - Spring 2018 Race Results - Fleet 2"]
[]
[null,null,null,null,"Spring","Spring","Spring","Spring","Spring","Spring","Spring","Spring","Spring","Spring",null,null,"Spring","Spring","Spring","Spring","Spring"]
["Skipper","Boat Name","Boat","Sail #","Race #1","Race #2","Race #3","Race #4","Race #5","Race #6","Race #7","Race #8","Make Up\n7m","Make Up\n2",null,null,"Sum","Throw\nout","Sum\nless\nThro out","Races\nthat\nCount","Avg"]
["Arnold","Arnold","Harbor 20",null,null,null,null,null,null,null,null,null,null,null,null,null,null,null,null,null,{"$f":"IFERROR(S17/T17,\"\")","v":""}]
["Tunnell/Maloney","Courageous","Harbor 20",278,null,null,1,5,2,3,null,null,3,1,null,null,{"$f":"SUM(E18:O18)","v":15},{"$f":"MAX(E18:O18)","v":5},{"$f":"Q18-R18","v":10},5,{"$f":"IFERROR(S18/T18,\"\")","v":2}]
["Whitt","Destiny","Alerion 20",6,1,null,3,1,4,4,null,null,null,null,null,null,13,null,13,{"$f":"COUNTA(E19:O19)","v":5},2.6]
["Hemler","Stoic","Harbor 20",330,2,null,6,3,3,1,null,null,1,3,null,null,19,6,13,6,2.1666666666666665]
["Toone","StressLess","Harbor 20",212,1.75,null,2,2,1,2,null,null,2,5,null,null,15.75,5,10.75,6,1.7916666666666667]
["Miekina","Synergy","Harbor 20",215,4,null,4,4,null,null,null,null,4,2,null,null,18,null,18,5,3.6]
["RC Score"]
["Throw Out"]
["Blackwater Yacht Racing Association - Spring 2018 Race Results - Fleet 3"]
[]
[null,null,null,null,"Spring","Spring","Spring","Spring","Spring","Spring","Spring","Spring","Spring","Spring",null,null,"Spring","Spring","Spring","Spring","Spring"]
["Skipper","Boat Name","Boat","Sail #","Race #1","Race #2","Race #3","Race #4","Race #5","Race #6","Race #7","Race #8","Make Up\n7m","Make Up\n2",null,null,"Sum","Throw\nout","Sum\nless\nThro out","Races\nthat\nCount","Avg"]
["Gobble","Always Something","Hunter 23",1256,4.5,null,5,5,4,4,null,null,null,null,null,null,{"$f":"SUM(E29:O29)","v":22.5},null,{"$f":"Q29-R29","v":22.5},{"$f":"COUNTA(E29:O29)","v":5},{"$f":"IFERROR(S29/T29,\"\")","v":4.5}]
["Perdue","Debra Ann","O'Day 25 CB",13092]
["Hull","Fools Game","Pearson 26",1183,1,null,3,3,2,1,null,null,3,3,null,null,{"$f":"SUM(E31:O31)","v":16},{"$f":"MAX(E31:O31)","v":3},{"$f":"Q31-R31","v":13},6,{"$f":"IFERROR(S31/T31,\"\")","v":2.1666666666666665}]
["Perdue","Miss Virginia","Hunter 23.5",1309,null,null,2,4,3.5,3.5,null,null,4,4,null,null,21,4,17,5,3.4]
["Schraw","Second Wind","Ericson 23",470,4,null,1,1,3,3,null,null,1,2,null,null,15,4,11,6,1.8333333333333333]
["Grogan","Twinkle","Hunter 23",686,2,null,4,2,1,2,null,null,2,1,null,null,14,4,10,6,1.6666666666666667]
["RC Score"]
["Throw Out"]
["Blackwater Yacht Racing Association - Spring 2018 Race Results - Fleet 4"]
[]
[null,null,null,null,"Spring","Spring","Spring","Spring","Spring","Spring","Spring","Spring","Spring","Spring",null,null,"Spring","Spring","Spring","Spring","Spring"]
["Skipper","Boat Name","Boat","Sail #","Race #1","Race #2","Race #3","Race #4","Race #5","Race #6","Race #7","Race #8","Make Up\n7m","Make Up\n2",null,null,"Sum","Throw\nout","Sum\nless\nThro out","Races\nthat\nCount","Avg"]
{"$rows_left_out":6}
{"sheet":"Fleet 2","index":3,"n_rows":21,"n_cols":36,"rows_kept":21,"cut":false,"hidden":true,"merged":[[5,0,5,12]]}
[]
[]
[{"$f":"#REF!","v":{"$error":"#REF!"}},"<-----Minutes after first start"]
[]
["Blackwater Yacht Racing Association - Race Results - Fleet 2"]
[]
[null,null,null,null,"Spring","Spring","Spring","Spring","Spring","Spring","Spring","Spring","Spring","Spring",null,null,"Spring","Spring","Spring","Spring","Spring"]
["Skipper","Boat Name","Boat","Sail #","Race #1","Race #2","Race #3","Race #4","Race #5","Race #6","Race #7","Race #8","Make Up\n7m","Make Up\n2",null,null,"Sum","Throw\nout","Sum\nless\nThro out","Races\nthat\nCount","Avg"]
["Arnold","Arnold","Harbor 20",null,null,null,null,null,null,null,null,null,null,null,null,null,null,null,null,null,{"$f":"IFERROR(S9/T9,\"\")","v":""},null,null,null,null,null,null,null,null,null,null,null,null,null,null,{"$f":"VLOOKUP($B9,#REF!,6,FALSE)","v":{"$error":"#REF!"}}]
["Tunnell/Maloney","Courageous","Harbor 20",278,null,null,1,5,2,3,null,null,3,1,null,null,{"$f":"SUM(E10:O10)","v":15},{"$f":"MAX(E10:O10)","v":5},{"$f":"Q10-R10","v":10},5,{"$f":"IFERROR(S10/T10,\"\")","v":2},null,null,null,null,null,null,null,null,null,null,null,null,null,null,{"$f":"VLOOKUP($B10,#REF!,6,FALSE)","v":{"$error":"#REF!"}}]
["Whitt","Destiny","Alerion 20",6,1,null,3,1,4,4,null,null,null,null,null,null,13,null,13,{"$f":"COUNTA(E11:O11)","v":5},2.6,null,null,null,null,null,null,null,null,null,null,null,null,null,null,{"$f":"VLOOKUP($B11,#REF!,6,FALSE)","v":{"$error":"#REF!"}}]
["Hemler","Stoic","Harbor 20",330,2,null,6,3,3,1,null,null,1,3,null,null,19,6,13,6,2.1666666666666665,null,null,null,null,null,null,null,null,null,null,null,null,null,null,{"$f":"VLOOKUP($B12,#REF!,6,FALSE)","v":{"$error":"#REF!"}}]
["Toone","StressLess","Harbor 20",212,1.75,null,2,2,1,2,null,null,2,5,null,null,15.75,5,10.75,6,1.7916666666666667,null,null,null,null,null,null,null,null,null,null,null,null,null,null,{"$f":"VLOOKUP($B13,#REF!,6,FALSE)","v":{"$error":"#REF!"}}]
["Miekina","Synergy","Harbor 20",215,4,null,4,4,null,null,null,null,4,2,null,null,18,null,18,5,3.6,null,null,null,null,null,null,null,null,null,null,null,null,null,null,{"$f":"VLOOKUP($B14,#REF!,6,FALSE)","v":{"$error":"#REF!"}}]
[null,null,null,null,null,null,null,null,null,null,null,null,null,null,null,null,null,null,null,null,null,null,null,null,null,null,null,null,null,null,null,null,null,null,null,{"$f":"VLOOKUP($B15,#REF!,6,FALSE)","v":{"$error":"#REF!"}}]
["RC Score"]
["Throw Out",null,null,null,null,null,null,null,null,null,null,null,null,null,null,null,null,null,null,null,null,null,null,null,null,null,null,null,null,null,null,null,null,null,{"$f":"VLOOKUP($B17,#REF!,6,FALSE)","v":{"$error":"#REF!"}}]
[null,null,null,null,null,null,null,null,null,null,null,null,null,null,null,null,null,null,null,null,null,null,null,null,null,null,null,null,null,null,null,null,null,null,{"$f":"VLOOKUP($B18,#REF!,6,FALSE)","v":{"$error":"#REF!"}}]
[null,null,null,null,null,null,null,null,null,null,null,null,null,null,null,null,null,null,null,null,null,null,null,null,null,null,null,null,null,null,null,null,null,null,{"$f":"VLOOKUP($B19,#REF!,6,FALSE)","v":{"$error":"#REF!"}}]
[null,null,null,null,null,null,null,null,null,null,null,null,null,null,null,null,null,null,null,null,null,null,null,null,null,null,null,null,null,null,null,null,null,null,{"$f":"VLOOKUP($B20,#REF!,6,FALSE)","v":{"$error":"#REF!"}}]
[null,null,null,null,null,null,null,null,null,null,null,null,null,null,null,null,null,null,null,null,null,null,null,null,null,null,null,null,null,null,null,null,null,null,{"$f":"VLOOKUP($B21,#REF!,6,FALSE)","v":{"$error":"#REF!"}}]

{"sheet":"Fleet 3","index":4,"n_rows":23,"n_cols":36,"rows_kept":23,"cut":false,"hidden":true,"merged":[[5,0,5,12]]}
[]
[]
[{"$f":"#REF!","v":{"$error":"#REF!"}},"<-----Minutes after first start"]
[]
["Blackwater Yacht Racing Association - Race Results - Fleet 3"]
[]
[null,null,null,null,"Spring","Spring","Spring","Spring","Spring","Spring","Spring","Spring","Spring","Spring",null,null,"Spring","Spring","Spring","Spring","Spring"]
["Skipper","Boat Name","Boat","Sail #","Race #1","Race #2","Race #3","Race #4","Race #5","Race #6","Race #7","Race #8","Make Up\n7m","Make Up\n2",null,null,"Sum","Throw\nout","Sum\nless\nThro out","Races\nthat\nCount","Avg"]
["Gobble","Always Something","Hunter 23",1256,4.5,null,5,5,4,4,null,null,null,null,null,null,{"$f":"SUM(E9:O9)","v":22.5},null,{"$f":"Q9-R9","v":22.5},{"$f":"COUNTA(E9:O9)","v":5},{"$f":"IFERROR(S9/T9,\"\")","v":4.5},null,null,null,null,null,null,null,null,null,null,null,null,null,null,{"$f":"VLOOKUP($B9,#REF!,6,FALSE)","v":{"$error":"#REF!"}}]
["Perdue","Debra Ann","O'Day 25 CB",13092,null,null,null,null,null,null,null,null,null,null,null,null,null,null,null,null,null,null,null,null,null,null,null,null,null,null,null,null,null,null,null,{"$f":"VLOOKUP($B10,#REF!,6,FALSE)","v":{"$error":"#REF!"}}]
["Hull","Fools Game","Pearson 26",1183,1,null,3,3,2,1,null,null,3,3,null,null,{"$f":"SUM(E11:O11)","v":16},{"$f":"MAX(E11:O11)","v":3},{"$f":"Q11-R11","v":13},6,{"$f":"IFERROR(S11/T11,\"\")","v":2.1666666666666665},null,null,null,null,null,null,null,null,null,null,null,null,null,null,{"$f":"VLOOKUP($B11,#REF!,6,FALSE)","v":{"$error":"#REF!"}}]
["Perdue","Miss Virginia","Hunter 23.5",1309,null,null,2,4,3.5,3.5,null,null,4,4,null,null,21,4,17,5,3.4,null,null,null,null,null,null,null,null,null,null,null,null,null,null,{"$f":"VLOOKUP($B12,#REF!,6,FALSE)","v":{"$error":"#REF!"}}]
["Schraw","Second Wind","Ericson 23",470,4,null,1,1,3,3,null,null,1,2,null,null,15,4,11,6,1.8333333333333333,null,null,null,null,null,null,null,null,null,null,null,null,null,null,{"$f":"VLOOKUP($B13,#REF!,6,FALSE)","v":{"$error":"#REF!"}}]
["Grogan","Twinkle","Hunter 23",686,2,null,4,2,1,2,null,null,2,1,null,null,14,4,10,6,1.6666666666666667,null,null,null,null,null,null,null,null,null,null,null,null,null,null,{"$f":"VLOOKUP($B14,#REF!,6,FALSE)","v":{"$error":"#REF!"}}]
[null,null,null,null,null,null,null,null,null,null,null,null,null,null,null,null,null,null,null,null,null,null,null,null,null,null,null,null,null,null,null,null,null,null,null,{"$f":"VLOOKUP($B15,#REF!,6,FALSE)","v":{"$error":"#REF!"}}]
["RC Score",null,null,null,null,null,null,null,null,null,null,null,null,null,null,null,null,null,null,null,null,null,null,null,null,null,null,null,null,null,null,null,null,null,null,{"$f":"VLOOKUP($B16,#REF!,6,FALSE)","v":{"$error":"#REF!"}}]
["Throw Out",null,null,null,null,null,null,null,null,null,null,null,null,null,null,null,null,null,null,null,null,null,null,null,null,null,null,null,null,null,null,null,null,null,{"$f":"VLOOKUP($B17,#REF!,6,FALSE)","v":{"$error":"#REF!"}}]
[null,null,null,null,null,null,null,null,null,null,null,null,null,null,null,null,null,null,null,null,null,null,null,null,null,null,null,null,null,null,null,null,null,null,{"$f":"VLOOKUP($B18,#REF!,6,FALSE)","v":{"$error":"#REF!"}}]
[null,null,null,null,null,null,null,null,null,null,null,null,null,null,null,null,null,null,null,null,null,null,null,null,null,null,null,null,null,null,null,null,null,null,{"$f":"VLOOKUP($B19,#REF!,6,FALSE)","v":{"$error":"#REF!"}}]
[null,null,null,null,null,null,null,null,null,null,null,null,null,null,null,null,null,null,null,null,null,null,null,null,null,null,null,null,null,null,null,null,null,null,{"$f":"VLOOKUP($B20,#REF!,6,FALSE)","v":{"$error":"#REF!"}}]
[null,null,null,null,null,null,null,null,null,null,null,null,null,null,null,null,null,null,null,null,null,null,null,null,null,null,null,null,null,null,null,null,null,null,{"$f":"VLOOKUP($B21,#REF!,6,FALSE)","v":{"$error":"#REF!"}}]
[null,null,null,null,null,null,null,null,null,null,null,null,null,null,null,null,null,null,null,null,null,null,null,null,null,null,null,null,null,null,null,null,null,null,{"$f":"VLOOKUP($B22,#REF!,6,FALSE)","v":{"$error":"#REF!"}}]
[null,null,null,null,null,null,null,null,null,null,null,null,null,null,null,null,null,null,null,null,null,null,null,null,null,null,null,null,null,null,null,null,null,null,{"$f":"VLOOKUP($B23,#REF!,6,FALSE)","v":{"$error":"#REF!"}}]

{"sheet":"Fleet 4","index":5,"n_rows":22,"n_cols":36,"rows_kept":22,"cut":false,"hidden":true,"merged":[[5,0,5,12]]}
[]
[]
[{"$f":"#REF!","v":{"$error":"#REF!"}},"<-----Minutes after first start"]
[]
["Blackwater Yacht Racing Association - Race Results - Fleet 4"]
[]
[null,null,null,null,"Spring","Spring","Spring","Spring","Spring","Spring","Spring","Spring","Spring","Spring",null,null,"Spring","Spring","Spring","Spring","Spring"]
["Skipper","Boat Name","Boat","Sail #","Race #1","Race #2","Race #3","Race #4","Race #5","Race #6","Race #7","Race #8","Make Up\n7m","Make Up\n2",null,null,"Sum","Throw\nout","Sum\nless\nThro out","Races\nthat\nCount","Avg"]
["Oginz","Alarming","S-2 9.2",505,4,null,2,3,1,1,null,null,2,2,null,null,{"$f":"SUM(E9:O9)","v":15},{"$f":"MAX(E9:O9)","v":4},{"$f":"Q9-R9","v":11},6,{"$f":"IFERROR(S9/T9,\"\")","v":1.8333333333333333},null,null,null,null,null,null,null,null,null,null,null,null,null,null,{"$f":"VLOOKUP($B9,#REF!,6,FALSE)","v":{"$error":"#REF!"}}]
["Johnson","Felicite","S-2 27 IB",13,4,null,null,null,"RC","RC",null,null,null,null,null,null,null,null,null,null,null,null,null,null,null,null,null,null,null,null,null,null,null,null,null,{"$f":"VLOOKUP($B10,#REF!,6,FALSE)","v":{"$error":"#REF!"}}]
["DeMestro","Little Wing","Beneteau 29",485,1,null,1,1,null,null,null,null,1,1,null,null,{"$f":"SUM(E11:O11)","v":5},null,{"$f":"Q11-R11","v":5},{"$f":"COUNTA(E11:O11)","v":5},{"$f":"IFERROR(S11/T11,\"\")","v":1},null,null,null,null,null,null,null,null,null,null,null,null,null,null,{"$f":"VLOOKUP($B11,#REF!,6,FALSE)","v":{"$error":"#REF!"}}]
["Gearhart","More Mischief","Beneteau 285",144,null,null,null,2,2,null,null,null,null,null,null,null,null,null,null,null,null,null,null,null,null,null,null,null,null,null,null,null,null,null,null,{"$f":"VLOOKUP($B12,#REF!,6,FALSE)","v":{"$error":"#REF!"}}]
["Conover","Willawaw","Columbia 29",222,null,null,null,null,null,null,null,null,null,null,null,null,null,null,null,null,null,null,null,null,null,null,null,null,null,null,null,null,null,null,null,{"$f":"VLOOKUP($B13,#REF!,6,FALSE)","v":{"$error":"#REF!"}}]
[null,null,null,null,null,null,null,null,null,null,null,null,null,null,null,null,null,null,null,null,null,null,null,null,null,null,null,null,null,null,null,null,null,null,null,{"$f":"VLOOKUP($B14,#REF!,6,FALSE)","v":{"$error":"#REF!"}}]
["RC Score",null,null,null,null,null,null,null,null,null,null,null,null,null,null,null,null,null,null,null,null,null,null,null,null,null,null,null,null,null,null,null,null,null,null,{"$f":"VLOOKUP($B15,#REF!,6,FALSE)","v":{"$error":"#REF!"}}]
["Throw Out",null,null,null,null,null,null,null,null,null,null,null,null,null,null,null,null,null,null,null,null,null,null,null,null,null,null,null,null,null,null,null,null,null,null,{"$f":"VLOOKUP($B16,#REF!,6,FALSE)","v":{"$error":"#REF!"}}]
[null,null,null,null,null,null,null,null,null,null,null,null,null,null,null,null,null,null,null,null,null,null,null,null,null,null,null,null,null,null,null,null,null,null,{"$f":"VLOOKUP($B17,#REF!,6,FALSE)","v":{"$error":"#REF!"}}]
[null,null,null,null,null,null,null,null,null,null,null,null,null,null,null,null,null,null,null,null,null,null,null,null,null,null,null,null,null,null,null,null,null,null,{"$f":"VLOOKUP($B18,#REF!,6,FALSE)","v":{"$error":"#REF!"}}]
[null,null,null,null,null,null,null,null,null,null,null,null,null,null,null,null,null,null,null,null,null,null,null,null,null,null,null,null,null,null,null,null,null,null,{"$f":"VLOOKUP($B19,#REF!,6,FALSE)","v":{"$error":"#REF!"}}]
[null,null,null,null,null,null,null,null,null,null,null,null,null,null,null,null,null,null,null,null,null,null,null,null,null,null,null,null,null,null,null,null,null,null,{"$f":"VLOOKUP($B20,#REF!,6,FALSE)","v":{"$error":"#REF!"}}]
[null,null,null,null,null,null,null,null,null,null,null,null,null,null,null,null,null,null,null,null,null,null,null,null,null,null,null,null,null,null,null,null,null,null,{"$f":"VLOOKUP($B21,#REF!,6,FALSE)","v":{"$error":"#REF!"}}]
[null,null,null,null,null,null,null,null,null,null,null,null,null,null,null,null,null,null,null,null,null,null,null,null,null,null,null,null,null,null,null,null,null,null,{"$f":"VLOOKUP($B22,#REF!,6,FALSE)","v":{"$error":"#REF!"}}]